Equinor,566342
Norsk Hydro,149766 
Yara International,113837
Telenor,113666
KLP,106634
NorgesGruppen,90326
Storebrand,87422
DNB,84772
Reitangruppen,73707
Coop Norge,48164
Statkraft,47933
Orkla,43615
Norwegian Air Shuttle,43522
Mowi,40278
Norsk Tipping,40278
Atea,36655
Veidekke,36460
Wallenius Wilhelmsen,34399
Subsea 7 Norway,32178
MøllerGruppen,30561
Gjensidige,29714
Aker BP,29454
Aker Solutions,29263
Sparebank 1 Gruppen,28305
Elkem,22246 
